position,composer,work,performer,date-display,catalogue,matrix-num,cat-num,venue,label,producer-engineer,page,volume,sound-file,
"1","Elvey","O King of Kings Elvey","MIXED CHOIR, ORGAN","1-3-11","kelly ","y 13283e","4908",,"HMV",,,,,
"2","Elvey","Arise, shine Elvey","VOCAL SEXTET (DAWSON, WILDE, GARDNER, etc), ORGAN","9-1-12","kelly ","ak 14753 e",,,"HMV",,,,,
"3","Elvey","Arise, shine Elvey","JONES-HUDSON, PIKE, WILDE, GARDNER, DAWSON","29-3-12","kelly ","ah 15110e","X-44808",,"HMV",,,,,
"4","Elvey","Christ is risen from the dead Elvey","CHOIR, ORGAN","17-1-13","kelly ","y 16244 e",,,"HMV",,,,,
"5","Elvey","Christ the Lord is risen today Elvey","CHOIR, ORGAN","17-1-13","kelly ","y 16246 e",,,"HMV",,,,,
"6","Elvey","Christ the Lord is risen today Elvey","CHOIR, ORGAN","17-1-13","kelly ","y 16247e","4917",,"HMV",,,,,
"7","Elvey","Come ye thankful people come Elvey","QUINTET (JONES-HUDSON, PIKE, WILDE, DAWSON, GARDNER) (MIXED CHURCH CHOIR), ORGAN","16-6-09","kelly ","10299e","T-6017",,"HMV",,,,,
"8","ELVEY","Christ the Lord has risen today","Richard Crooks, tenor","1932-10-03","gray ","0B 3445","DA1289",,"HMV",,,,,
